BDBM50192105 1-{[4-(dihydroxyboranyl)phenyl]methyl}guanidine; 2,2,2-trifluoroacetic acid::CHEMBL215135
SMILES [#7]\[#6](-[#7])=[#7]\[#6]-c1ccc(cc1)-[#5](-[#8])-[#8]
InChI Key InChIKey=AJHZTPULNIOMAE-UHFFFAOYSA-N
Data  3 IC50
  Tab Delimited (TSV)   2D SDfile   Computed 3D by Vconf -m prep SDfile
Find this compound or compounds like it in BindingDB:
Activity Spreadsheet -- Enzyme Inhibition Constant Data from BindingDB
Found 1 hit for monomerid = 50192105
TargetCoagulation factor X(Homo sapiens (Human))
Daiichi Asubio Medical Research Laboratories
Curated by ChEMBL
LigandPNGBDBM50192105(1-{[4-(dihydroxyboranyl)phenyl]methyl}guanidine; 2...)
Affinity DataIC50: >2.00E+5nM. Assay description: Inhibition of f10a
In DepthDetails ArticlePubMed